{"text_format":"3","workbook":"xlsx","n_sheets":9,"sheets":["Ohje","Lähtötiedot","Tulokset","Materiaalitiedot","Ennen käyttöä (A)","Materiaalit (A1-3)","Käyttö (B)","Loppu ja lisätiedot (C+D)","Datalehti"],"not_rendered":{"charts":2,"images":7,"macros":1,"defined_names":27,"comments":1,"pivot_tables":1},"read":"whole","date_system":"1900"}

{"sheet":"Ohje","index":0,"n_rows":21,"n_cols":2,"rows_kept":21,"merged":[[1,1,1,2],[6,1,6,2],[9,1,9,2],[13,1,13,2],[15,1,15,2],[17,1,17,2],[20,1,20,2]]}
[]
[null,"Rakennuksen hiilijalanjäljen arviointityökalun luonnos"]
[null,"Luonnos lausuntokierrosta varten 16.11.2018"]
[]
[null,"Käyttöohje"]
[]
[null,"Tämä arviointityökalun luonnosversio on tarkoitettu rakennuksen hiilijalanjäljen laskentamenetelmän lausuntokierrosta varten. Työkalua ja sen liitteenä olevia päästötietoja kehitetään lausuntokierroksen jälkeen.\n\nAvoimen työkalun tarkoituksena on tukea ja edistää elinkaarilaskennan käyttöä rakennushankkeen valmistelussa, suunnittelussa, rakentamisessa ja rakennusten käytön aikana. Tämä työkalu on tarkoitettu rakennusten elinkaaren hiilijalanjäljen arviointiin ensisijaisesti silloin, kun käytetään ympäristöministeriön yksinkertaistettua arviointimenetelmää. Työkalua voidaan käyttää myös tarkennetulla arviointimenetelmällä tehtyjen laskelmien raportointiin. Arvioinnit voi tehdä myös muilla soveltuvilla työkaluilla. "]
[]
[null,"Työkalun sisältö"]
[null,"Työkalun eri välilehdillä kerätään tietoa hankkeesta ja sen elinkaarivaikutuksista seuraavasti:\n\nLähtötiedot: Käytetyn lähtötiedon luotettavuuden arviointi\nTulokset: Arvioinnin tulokset, tiedot arvioitavasta kohteesta ja arvioinnin teosta\nMateriaalitiedot: Työkalussa käytettävien hiilijalanjäljen ja -kädenjäljen kertoimet\nEnnen käyttöä: Valmistuksen, kuljetuksen ja rakentamisen päästöt\nMateriaalit: Rakennuksessa käytettyjen materiaalien luettelointi\nKäyttö: Korjausten ja energiankulutuksen arviointi\nLoppu ja lisätiedot:  Purkamisen ja jätteiden käsittelyn arviointi\n"]
[null,"Laskentatietojen syöttäminen "]
[]
[null,"Syötä tiedot harmaisiin soluihin."]
[null,"Tietoja voidaan lisätä tummansinisellä otsikoituihin kohtiin. Syötä tiedot harmaapohjaisiin soluihin."]
[null,"Valmiit taulukkoarvot sinisissä soluissa."]
[null,"Yksinkertaistetussa menetelmässä suurin osa laskennan tiedoista tulee hanketyyppiin ja pinta-alaan perustuvista taulukkoarvoista. Tällaiset kohdat työkalussa on otsioitu vaaleansinisellä värillä."]
[null,"Lisätietoja voit syöttää vihreisiin soluihin."]
[null,"Jos korvaat taulukkoarvoja omin laskelmin, syötä nämä tiedot vihreisiin soluihin. Taulukkoarvon vieressä olevaa plus-merkkiä painamalla aukeaa uusi tietokenttä tätä varten. Vaalean vihreisiin soluihin syötetyt arvot korvaavat oletuksena olevat taulukkoarvot. Muista kirjata ylös, mihin tietoihin omat laskelmasi perustuvat. Esimerkki:"]
[]
[null,"Käyttöoikeus ja vastuuvapaus"]
{"$rows_left_out":2}
{"sheet":"Lähtötiedot","index":1,"n_rows":31,"n_cols":8,"rows_kept":31,"merged":[[4,1,4,2],[7,1,7,7],[23,3,23,4],[23,5,23,6],[24,3,24,4],[24,5,24,6],[25,3,25,4],[25,5,25,6],[26,3,26,4],[26,5,26,6],[27,3,27,4],[27,5,27,6],[31,1,31,7]]}
[]
[null,{"$f":"Ohje!B2","v":"Rakennuksen hiilijalanjäljen arviointityökalun luonnos"}]
[null,{"$f":"Ohje!B3","v":"Luonnos lausuntokierrosta varten 16.11.2018"}]
[]
[null,"Lähtötietojen arviointi"]
[]
[null,"Tietojen laatu"]
[null,"Arvioinnissa käytettävien tietojen laatu tulee arvioida, jos arviointi tehdään käyttäen ns. tarkennettua menetelmää. Yksinkertaistettua menetelmää käytettäessä tätä välilehteä ei tarvitse täyttää. \nAlla ehdotettu lähtötietojen arviointitapa perustuu Euroopan komission Level(s)-menetelmään."]
[null,"Elinkaaren vaiheet","Teknologinen edustavuus","Maan-tieteellinen edustavuus","Ajallinen edustavuus","Epävarmuus","Yhteensä","Vähimmäisvaatimukset"]
[]
[null,"A1–3 Tuotteiden valmistus",{"$nulls":4},{"$f":"(SUM(C11:F11))","v":0},"Tiedot vähintään tasoa 2"]
[null,"A4 Kuljetus työmaalle",{"$nulls":4},{"$f":"IFERROR(SUM(C12:F12),\"\")","v":0},"Maantieteellinen edustavuus oltava tasoa 3"]
[null,"A5 Työmaan toiminnot",{"$nulls":4},0,"Maantieteellinen edustavuus vähintään tasoa 2"]
[null,"B3–4 Korjaukset ja vaihdot",{"$nulls":4},0,"Maantieteellinen edustavuus vähintään tasoa 2"]
[null,"B6 Energian kulutus",{"$nulls":4},0,"Tiedot vähintään tasoa 2"]
[null,"C1 Purkutyöt",{"$nulls":4},0,"Ei vähimmäisvaatimuksia"]
[null,"C2 Kuljetus jatkokäsittelyyn",{"$nulls":4},0,"Ei vähimmäisvaatimuksia"]
[null,"C3 Jätteenkäsittely",{"$nulls":4},0,"Ei vähimmäisvaatimuksia"]
[null,"C4 Loppusijoitus",{"$nulls":4},0,"Ei vähimmäisvaatimuksia"]
[null,"D Elinkaaren ulkopuoliset",{"$nulls":4},0,"Ei vähimmäisvaatimuksia"]
{"$rows_left_out":12}
{"sheet":"Tulokset","index":2,"n_rows":41,"n_cols":9,"rows_kept":41,"merged":[[1,1,1,3],[6,1,6,4],[7,1,9,1],[7,3,7,4],[8,3,8,4],[9,3,9,4],[10,1,15,1],[10,3,10,4],[11,3,11,4],[12,3,12,4],[13,3,13,4],[14,3,14,4],[15,3,15,4],[16,3,16,4],[17,3,17,4],[18,3,18,4],[19,3,19,4],[21,1,21,2],[23,1,23,2],[24,1,24,2],[25,1,25,2],[26,1,26,2],[27,1,27,2],[28,1,28,2],[29,1,29,2],[30,1,30,2],[31,1,31,2],[32,1,32,2],[33,1,33,2],[34,1,34,2],[36,1,36,2],[37,3,37,4],[38,3,38,4],[39,3,39,4],[40,3,40,4]]}
[]
[null,{"$f":"Ohje!B2","v":"Rakennuksen hiilijalanjäljen arviointityökalun luonnos"}]
[null,{"$f":"Ohje!B3","v":"Luonnos lausuntokierrosta varten 16.11.2018"}]
[]
[null,"Laskennan tulokset"]
[]
[null,"Lähtötiedot"]
[null,"Rakennuskohteen tiedot","Rakennustunnus"]
[null,null,"Osoite"]
[null,null,"Rakennustyyppi"]
[null,"Rakennuksen tekniset tiedot","Kerrosala [kem2]"]
[null,null,"Lämmitetty nettoala [m2netto]"]
[null,null,"Kerrosten lukumäärä"]
[null,null,"Kellarikerrosten lukumäärä"]
[null,null,"Pääasiallinen runkomateriaali"]
[null,null,"Energialuokka"]
[null,"Laskennan tiedot","Laskenta-ajanjakso",{"$f":"IF(D10=\"\",\"\",IF(D10=Datalehti!H34,75,50))","v":""}]
[null,null,"Arvioinnin tekovaihe"]
[null,null,"Käytetty arviointitapa"]
[null,null,"Rakennuksen arvioitu käyttöönottovuosi"]
{"$rows_left_out":22}
{"sheet":"Materiaalitiedot","index":3,"n_rows":237,"n_cols":10,"rows_kept":237,"merged":[[5,1,5,7]]}
[]
[null,{"$f":"Ohje!B2","v":"Rakennuksen hiilijalanjäljen arviointityökalun luonnos"}]
[null,{"$f":"Ohje!B3","v":"Luonnos lausuntokierrosta varten 16.11.2018"}]
[]
[null,"Materiaalitiedot"]
[null,"© VTT 2018. Testausvaiheen geneerinen päästötaulukko perustuu VTT:n eri lähteistä kokoamiin ja arvioimiin tuloksiin. Arvot on koottu siten, että ne kattavat elinkaaren vaiheet A1 - A5 (vaiheessa A5 vain arvioidun hukan osalta). VTT:llä on yksinomainen omistus- ja tekijänoikeus kokonaistaulukkoon. Taulukkoa saa käyttää testaamiseen eikä sitä saa muuttaa, käyttää eikä luovuttaa käytettäväksi muuhun tarkoitukseen ilman VTT:n nimenomaista suostumusta. \nTaulukko on tarkoitettu vain menetelmän testausvaiheeseen eikä VTT ota vastuuta siihen sisältyvien tietojen oikeellisuudesta."]
[null,"Materiaali","CO2e","Hiilisisältö","CO2e","Hiilijalanjälki","Hiilikädenjälki","Yksikkö"]
[null,"BETONI","kg/kg","kg CO2/kg","kg/m2"]
[null,"Betoni, lattiabetoni (35)",{"v":0.15497999999999998,"d":"0.155"},null,null,{"$f":"IF(E9=\"\",IF(C9=\"\",\"\",C9),E9)","v":{"v":0.15497999999999998,"d":"0.155"}},{"$f":"IF(F9=\"\",\"\",D9*-1)","v":{"v":0,"d":"0.00"}},{"$f":"IF(F9=\"\",\"\",(IF(E9=\"\",\"CO2e/kg\",\"CO2e/m2\")))","v":"CO2e/kg"},{"$f":"IF(F9=\"\",\"\",(IF(E9=\"\",\"kg\",\"m2\")))","v":"kg"},"Huom: Betoni- ja sementtituotteiden hiilikädenjälki (keskimääräiset karbonatisoitumistiedot) laaditaan lausuntokierroksen jälkeen."]
[null,"Betonikuori 100 mm+musta teräs",{"v":0.19142008000000002,"d":"0.191"},null,null,{"v":0.19142008000000002,"d":"0.191"},{"$f":"IF(F10=\"\",\"\",D10*-1)","v":{"v":0,"d":"0.00"}},{"$f":"IF(F10=\"\",\"\",(IF(E10=\"\",\"CO2e/kg\",\"CO2e/m2\")))","v":"CO2e/kg"},{"$f":"IF(F10=\"\",\"\",(IF(E10=\"\",\"kg\",\"m2\")))","v":"kg"}]
[null,"Betonikuori 150 mm+musta teräs",{"v":0.1931541,"d":"0.193"},null,null,{"v":0.1931541,"d":"0.193"},{"v":0,"d":"0.00"},"CO2e/kg","kg"]
[null,"Betonikuori 80 mm+musta teräs",{"v":0.18968605999999996,"d":"0.190"},null,null,{"v":0.18968605999999996,"d":"0.190"},{"v":0,"d":"0.00"},"CO2e/kg","kg"]
[null,"Betoniulkokuori+ruostumaton teräs",{"v":0.21104802,"d":"0.211"},null,null,{"v":0.21104802,"d":"0.211"},{"v":0,"d":"0.00"},"CO2e/kg","kg"]
[null,"Elementti, betoniväliseinä",{"v":0.20158,"d":"0.202"},null,null,{"v":0.20158,"d":"0.202"},{"v":0,"d":"0.00"},"CO2e/kg","kg"]
[null,"Betoni 16/20 Mpa",{"$f":"0.1*1.1+(20*(0.038/1000))","v":{"v":0.11076000000000001,"d":"0.111"}},null,null,{"v":0.11076000000000001,"d":"0.111"},{"v":0,"d":"0.00"},"CO2e/kg","kg","Pelkkä betoni, ei raudoituksia."]
[null,"Betoni 20/25 Mpa",{"$f":"0.107*1.1+(20*(0.038/1000))","v":{"v":0.11846000000000001,"d":"0.118"}},null,null,{"v":0.11846000000000001,"d":"0.118"},{"v":0,"d":"0.00"},"CO2e/kg","kg"]
[null,"Betoni 25/30 Mpa",{"$f":"0.113*1.1+(20*(0.038/1000))","v":{"v":0.12506,"d":"0.125"}},null,null,{"v":0.12506,"d":"0.125"},{"v":0,"d":"0.00"},"CO2e/kg","kg"]
[null,"Betoni 28/35 Mpa",{"$f":"0.12*1.1+(20*(0.038/1000))","v":{"v":0.13276000000000002,"d":"0.133"}},null,null,{"v":0.13276000000000002,"d":"0.133"},{"v":0,"d":"0.00"},"CO2e/kg","kg"]
[null,"Betoni 32/40 Mpa",{"$f":"0.132*1.1+(20*(0.038/1000))","v":{"v":0.14596000000000003,"d":"0.146"}},null,null,{"v":0.14596000000000003,"d":"0.146"},{"v":0,"d":"0.00"},"CO2e/kg","kg"]
[null,"Betoni 40/50 Mpa",{"$f":"0.151*1.1+(20*(0.038/1000))","v":{"v":0.16686,"d":"0.167"}},null,null,{"v":0.16686,"d":"0.167"},{"v":0,"d":"0.00"},"CO2e/kg","kg"]
{"$rows_left_out":218}
{"sheet":"Ennen käyttöä (A)","index":4,"n_rows":26,"n_cols":4,"rows_kept":26,"merged":[[14,1,14,3],[18,1,18,3],[21,1,21,3],[25,1,25,3]]}
[]
[null,{"$f":"Ohje!B2","v":"Rakennuksen hiilijalanjäljen arviointityökalun luonnos"}]
[null,{"$f":"Ohje!B3","v":"Luonnos lausuntokierrosta varten 16.11.2018"}]
[null,"Ennen käyttöä syntyvien päästöjen yhteenveto"]
[]
[null,null,"Hiilijalanjälki","Hiilikädenjälki"]
[null,null,"kgCO2e","kgCO2e"]
[null,"Ennen käyttöä syntyvät päästöt yhteensä",{"$f":"C10+C21","v":0},{"$f":"D10+D21","v":0}]
[]
[null,"Valmistus ja kuljetusvaihe (A1-4)",{"$f":"IF(C17=\"\",SUM(C11:C14),C17)","v":0},{"$f":"IF(D17=\"\",SUM(D11:D14),D17)","v":0}]
[null,"Tontti",{"$f":"Tontti[[#Totals],[Column8]]","v":0},{"$f":"Tontti[[#Totals],[Column9]]","v":0}]
[null,"Kantavat rakenteet",{"$f":"Kantavat[[#Totals],[Column8]]+Vaippa[[#Totals],[Column8]]","v":0},{"$f":"Kantavat[[#Totals],[Column9]]+Vaippa[[#Totals],[Column9]]","v":0}]
[null,"Kevyet rakenteet",{"$f":"Kevyet[[#Totals],[Column8]]","v":0},{"$f":"Kevyet[[#Totals],[Column9]]","v":0}]
[null,"Talotekniikka",{"$f":"TATE[[#Totals],[Column8]]","v":0},{"$f":"TATE[[#Totals],[Column9]]","v":0}]
[null,"Valmistusvaiheen päästöjen tulokset muodostuvat automaattisesti välilehdellä \"Materiaalit\" annettujen arvojen perusteella."]
[]
[null,"Valmistus ja kuljetusvaihe (A1-4) tarkennettu laskenta"]
[]
[null,"Selitä tähän kenttään miten ja mistä tarkemmat arvot on saatu. Esitä tarvittaessa erilliset laskelmat liitteenä. Tarkempia laskelmia käytettäessä älä syötä mitään lukuja ylempään taulukkoon tai Materiaalit - välilehdelle."]
[]
{"$rows_left_out":7}
{"sheet":"Materiaalit (A1-3)","index":5,"n_rows":51,"n_cols":11,"rows_kept":51,"merged":[[5,1,5,8],[49,1,49,2]]}
[]
[null,{"$f":"Ohje!B2","v":"Rakennuksen hiilijalanjäljen arviointityökalun luonnos"}]
[null,{"$f":"Ohje!B3","v":"Luonnos lausuntokierrosta varten 16.11.2018"}]
[]
[null,"Luettelo rakennuksessa käytetyistä materiaaleista"]
[null,"Syötä rakennuksen materiaalien paino alla olevaan listaan esim. määräluettelon pohjalta laskien. Hiilijalanjäljen ja -kädenjäljen päästöt muodostuvat automaattisesti, kun määrät on syötetty. Lisää tarvittaessa rivejä kunkin otsakkeen alle Lisää rivi -napilla.",{"$nulls":7},"kgCO2e","kgCO2e"]
[null,"Littera","Rakennusosa","Materiaalin tyyppi","Materiaali",null,"Määrä",null,null,"Hiilijalanjälki","Hiilikädenjälki"]
[]
[]
[null,"Tontti (1.1. Alueosat)"]
[{"$nulls":7},{"$f":"IF(E11=\"\",\"\",VLOOKUP(E11,Materiaalitiedot!B:I,8,FALSE))","v":""},null,{"$f":"IF(E11=\"\",\"\",G11*VLOOKUP(E11,Materiaalitiedot!B:H,5,FALSE))","v":""},{"$f":"IF(E11=\"\",\"\",G11*VLOOKUP(E11,Materiaalitiedot!B:H,6,FALSE))","v":""}]
[{"$nulls":7},{"$f":"IF(E12=\"\",\"\",VLOOKUP(E12,Materiaalitiedot!B:I,8,FALSE))","v":""},null,{"$f":"IF(E12=\"\",\"\",G12*VLOOKUP(E12,Materiaalitiedot!B:H,5,FALSE))","v":""},{"$f":"IF(E12=\"\",\"\",G12*VLOOKUP(E12,Materiaalitiedot!B:H,6,FALSE))","v":""}]
[{"$nulls":7},{"$f":"IF(E13=\"\",\"\",VLOOKUP(E13,Materiaalitiedot!B:I,8,FALSE))","v":""},null,{"$f":"IF(E13=\"\",\"\",G13*VLOOKUP(E13,Materiaalitiedot!B:H,5,FALSE))","v":""},{"$f":"IF(E13=\"\",\"\",G13*VLOOKUP(E13,Materiaalitiedot!B:H,6,FALSE))","v":""}]
[{"$nulls":7},{"$f":"IF(E14=\"\",\"\",VLOOKUP(E14,Materiaalitiedot!B:I,8,FALSE))","v":""},null,{"$f":"IF(E14=\"\",\"\",G14*VLOOKUP(E14,Materiaalitiedot!B:H,5,FALSE))","v":""},{"$f":"IF(E14=\"\",\"\",G14*VLOOKUP(E14,Materiaalitiedot!B:H,6,FALSE))","v":""}]
[{"$nulls":7},{"$f":"IF(E15=\"\",\"\",VLOOKUP(E15,Materiaalitiedot!B:I,8,FALSE))","v":""},null,{"$f":"IF(E15=\"\",\"\",G15*VLOOKUP(E15,Materiaalitiedot!B:H,5,FALSE))","v":""},{"$f":"IF(E15=\"\",\"\",G15*VLOOKUP(E15,Materiaalitiedot!B:H,6,FALSE))","v":""}]
[null,"Total",{"$nulls":7},{"$f":"SUBTOTAL(109,Tontti[Column8])","v":0},{"$f":"SUBTOTAL(109,Tontti[Column9])","v":0}]
[]
[null,"Kantavat rakenteet (1.2.1-1.2.3 Talo-osat)"]
[{"$nulls":7},{"$f":"IF(E19=\"\",\"\",VLOOKUP(E19,Materiaalitiedot!B:I,8,FALSE))","v":""},null,{"$f":"IF(E19=\"\",\"\",G19*VLOOKUP(E19,Materiaalitiedot!B:H,5,FALSE))","v":""},{"$f":"IF(E19=\"\",\"\",G19*VLOOKUP(E19,Materiaalitiedot!B:H,6,FALSE))","v":""}]
[{"$nulls":7},{"$f":"IF(E20=\"\",\"\",VLOOKUP(E20,Materiaalitiedot!B:I,8,FALSE))","v":""},null,{"$f":"IF(E20=\"\",\"\",G20*VLOOKUP(E20,Materiaalitiedot!B:H,5,FALSE))","v":""},{"$f":"IF(E20=\"\",\"\",G20*VLOOKUP(E20,Materiaalitiedot!B:H,6,FALSE))","v":""}]
{"$rows_left_out":32}
{"sheet":"Käyttö (B)","index":6,"n_rows":27,"n_cols":5,"rows_kept":27,"merged":[[4,1,4,2],[15,1,15,4],[16,1,16,4],[19,1,19,4],[21,1,21,2],[22,1,22,4],[26,1,26,4]]}
[]
[null,{"$f":"Ohje!B2","v":"Rakennuksen hiilijalanjäljen arviointityökalun luonnos"}]
[null,{"$f":"Ohje!B3","v":"Luonnos lausuntokierrosta varten 16.11.2018"}]
[]
[null,"Käyttövaiheen päästöjen arviointi"]
[]
[{"$nulls":3},"Hiilijalanjälki","Hiilikädenjälki"]
[{"$nulls":3},"kgCO2e","kgCO2e"]
[null,"Ennen käyttöä syntyvät päästöt yhteensä",null,{"$f":"D11+D22","v":0},{"$f":"E11+E22","v":0}]
[]
[null,"Energiankäyttö (B6)","Energiankulutus (kWh/a)",{"$f":"IF(D18=\"\",SUM(D12:D15),D18)","v":0},{"$f":"IF(E18=\"\",SUM(E12:E15),E18)","v":0}]
[null,"Sähkö",null,{"$f":"IFERROR(C12*Datalehti!S14,\"\")","v":""},"-"]
[null,"Kaukolämpö",null,{"$f":"IFERROR(C13*Datalehti!S15,\"\")","v":""},"-"]
[null,"Fossiiliset polttoaineet",null,{"$f":"IFERROR(C14*Datalehti!S16,\"\")","v":""},"-"]
[null,"Uusiutuvat polttoaineet",null,{"$f":"IFERROR(C15*Datalehti!S17,\"\")","v":""},"-"]
[null,"Syötä yllä olevaan listaan rakennuksen laskennallinen vuotuinen ostoenergian kulutus energiaselvityksen tai vastaavan laskelman pohjalta. Enerigiankäytön päästöt muodostuvat automaattisesti eri energiamuotojen päästötietojen perusteella, kun kulutus on syötetty. Energiamuotojen päästökertoimia ei voi muuttaa. Energiamuodoilla ei tässä laskennassa voi olla hiilikädenjälkeä."]
[]
[null,"Energiankäyttö (B6) tarkennettu laskenta"]
[]
[null,"Selitä tähän kenttään miten ja mistä tarkemmat arvot on saatu. Esitä tarvittaessa erilliset laskelmat liitteenä. Tarkempia laskelmia käytettäessä älä syötä mitään lukuja ylempään taulukkoon."]
{"$rows_left_out":8}
{"sheet":"Loppu ja lisätiedot (C+D)","index":7,"n_rows":33,"n_cols":5,"rows_kept":33,"merged":[[10,1,10,2],[11,1,11,4],[14,1,14,4],[16,1,16,2],[17,1,17,4],[20,1,20,4],[23,1,23,4],[26,1,26,4],[28,1,28,2],[29,1,29,4],[32,1,32,4]]}
[]
[null,{"$f":"Ohje!B2","v":"Rakennuksen hiilijalanjäljen arviointityökalun luonnos"}]
[null,{"$f":"Ohje!B3","v":"Luonnos lausuntokierrosta varten 16.11.2018"}]
[]
[null,"Elinkaaren lopun päästötiedot"]
[]
[{"$nulls":3},"Hiilijalanjälki","Hiilikädenjälki"]
[{"$nulls":3},"kgCO2e","kgCO2e"]
[null,"Elinkaaren lopussa syntyvät päästöt yhteensä",null,{"$f":"D23+D17+D11+D29","v":0},{"$f":"E23+E17+E11+E29","v":0}]
[]
[null,"Purkaminen (C1)",null,{"$f":"IF(D13=\"\",Datalehti!C38*Tulokset!$D$11,D13)","v":0},{"$f":"IF(E13=\"\",Datalehti!D38*Tulokset!$D$11,E13)","v":0}]
[null,"Päästötiedot pohjautuvat taulukkoarvoihin."]
[null,"Purkaminen (C1) tarkennettu laskenta"]
[]
[null,"Selitä tähän kenttään miten ja mistä tarkemmat arvot on saatu. Esitä tarvittaessa erilliset laskelmat liitteenä."]
[]
[null,"Kuljetukset (C2)",null,{"$f":"IF(D19=\"\",Datalehti!C39*Tulokset!$D$11,D19)","v":0},{"$f":"IF(E19=\"\",Datalehti!D39*Tulokset!$D$11,E19)","v":0}]
[null,"Päästötiedot pohjautuvat taulukkoarvoihin."]
[null,"Kuljetukset (C2) tarkennettu laskenta"]
[]
{"$rows_left_out":14}
{"sheet":"Datalehti","index":8,"n_rows":56,"n_cols":19,"rows_kept":56,"hidden":true}
[]
[]
[null,"Laskennalliset päästöt (kgCO2e /kWh)"]
[]
[null,"Energiamuoto",2010,2020,2030,2040,2050,2060,2070,2080,2090,2100,2110,2120,2130,2140,2150]
[null,"Sähkö",0.09,0.09,0.06,0.06,0.06,0.06,0.06,0.06,0.06,0.06,{"$f":"L6","v":0.06},{"$f":"M6","v":0.06},0.06,0.06,0.06]
[null,"Kaukolämpö",0.22,0.22,0.14,0.14,0.14,0.14,0.14,0.14,0.14,0.14,{"$f":"L7","v":0.14},0.14,0.14,0.14,0.14]
[null,"Fossiiliset ",0.26,0.26,0.26,0.26,0.26,0.26,0.26,0.26,0.26,0.26,0.26,0.26,0.26,0.26,0.26]
[null,"Uusiutuvat ",0,0,0,0,0,0,0,0,0,0,0,0,0,0,0]
[]
[null,"Laskennan vuodet",{"$f":"IF(C13>$E20,IF(C13<$E22,10,IF(C13<$E22+1,$E23,0)),(IF(C13>$E20-1,10-$E21,0)))","v":{"$error":"#VALUE!"}},{"$error":"#VALUE!"},{"$error":"#VALUE!"},{"$error":"#VALUE!"},{"$error":"#VALUE!"},{"$error":"#VALUE!"},{"$error":"#VALUE!"},{"$error":"#VALUE!"},{"$error":"#VALUE!"},{"$error":"#VALUE!"},{"$error":"#VALUE!"},{"$error":"#VALUE!"},{"$error":"#VALUE!"},{"$error":"#VALUE!"},{"$error":"#VALUE!"}]
[]
[null,"Energiamuoto",2010,2020,2030,2040,2050,2060,2070,2080,2090,2100,2110,2120,2130,2140,2150,null,"Päästökerroin"]
[null,"Sähkö",{"$f":"C$11*C6","v":{"$error":"#VALUE!"}},{"$error":"#VALUE!"},{"$error":"#VALUE!"},{"$error":"#VALUE!"},{"$error":"#VALUE!"},{"$error":"#VALUE!"},{"$error":"#VALUE!"},{"$error":"#VALUE!"},{"$error":"#VALUE!"},{"$error":"#VALUE!"},{"$error":"#VALUE!"},{"$error":"#VALUE!"},{"$error":"#VALUE!"},{"$error":"#VALUE!"},{"$error":"#VALUE!"},null,{"$f":"SUM(C14:Q14)","v":{"$error":"#VALUE!"}}]
[null,"Kaukolämpö",{"$f":"C$11*C7","v":{"$error":"#VALUE!"}},{"$error":"#VALUE!"},{"$error":"#VALUE!"},{"$error":"#VALUE!"},{"$error":"#VALUE!"},{"$error":"#VALUE!"},{"$error":"#VALUE!"},{"$error":"#VALUE!"},{"$error":"#VALUE!"},{"$error":"#VALUE!"},{"$error":"#VALUE!"},{"$error":"#VALUE!"},{"$error":"#VALUE!"},{"$error":"#VALUE!"},{"$error":"#VALUE!"},null,{"$f":"SUM(C15:Q15)","v":{"$error":"#VALUE!"}}]
[null,"Fossiiliset ",{"$f":"C$11*C8","v":{"$error":"#VALUE!"}},{"$f":"D$11*D8","v":{"$error":"#VALUE!"}},{"$error":"#VALUE!"},{"$error":"#VALUE!"},{"$error":"#VALUE!"},{"$error":"#VALUE!"},{"$error":"#VALUE!"},{"$error":"#VALUE!"},{"$error":"#VALUE!"},{"$error":"#VALUE!"},{"$error":"#VALUE!"},{"$error":"#VALUE!"},{"$error":"#VALUE!"},{"$error":"#VALUE!"},{"$error":"#VALUE!"},null,{"$error":"#VALUE!"}]
[null,"Uusiutuvat ",{"$f":"C$11*C9","v":{"$error":"#VALUE!"}},{"$f":"D$11*D9","v":{"$error":"#VALUE!"}},{"$error":"#VALUE!"},{"$error":"#VALUE!"},{"$error":"#VALUE!"},{"$error":"#VALUE!"},{"$error":"#VALUE!"},{"$error":"#VALUE!"},{"$error":"#VALUE!"},{"$error":"#VALUE!"},{"$error":"#VALUE!"},{"$error":"#VALUE!"},{"$error":"#VALUE!"},{"$error":"#VALUE!"},{"$error":"#VALUE!"},null,{"$error":"#VALUE!"}]
[]
[]
[{"$nulls":4},{"$f":"INT(LEFT(C21,3)&\"0\")","v":0}]
{"$rows_left_out":29}